Target
Beta-secretase 1
Ligand
BDBM15779
Substrate
BACE-1 Peptide Substrate
Meas. Tech.
BACE-1 Inhibition Assay
pH
5±n/a
Temperature
295.15±n/a K
IC50
94000±n/a nM
Citation
 Congreve, MAharony, DAlbert, JCallaghan, OCampbell, JCarr, RAChessari, GCowan, SEdwards, PDFrederickson, MMcMenamin, RMurray, CWPatel, SWallis, N Application of fragment screening by X-ray crystallography to the discovery of aminopyridines as inhibitors of beta-secretase. J Med Chem 50:1124-32 (2007)  
Target
Name:
Beta-secretase 1
Synonyms:
ASP2 Aspartyl protease 2 BACE1 Beta-secretase (BACE) Beta-secretase 1 (BACE 1) Beta-secretase 1 (BACE1) Beta-site amyloid precursor protein cleaving enzyme 1 Memapsin-2 beta-Secretase (BACE-1) | beta-Secretase (BACE1)
Type:
Protein
Mol. Mass.:
55755.10
Organism:
Homo sapiens (Human)
Description:
P56817
Residue:
501
  
Inhibitor
Name:
BDBM15779
Synonyms:
6-Substituted 2-Aminopyridine 3 | 6-[2-(1H-indol-6-yl)ethyl]pyridin-2-amine
Type:
Small organic molecule
Emp. Form.:
C15H15N3
Mol. Mass.:
237.2997
SMILES:
Nc1cccc(CCc2ccc3cc[nH]c3c2)n1
:
Substrate
Name:
BACE-1 Peptide Substrate
Synonyms:
Type:
Peptide
Mol. Mass.:
2721.34
Organism:
Description:
Residue:
23