Target
Acetyl-CoA carboxylase 2
Ligand
BDBM350113
Substrate
Meas. Tech.
In Vitro Acetyl-CoA Carboxylase (ACC) Inhibition Assay
IC50
35000±0 nM
Citation
 Greenwood, JRHarriman, GCBorg, GMasse, CE ACC inhibitors and uses thereof US Patent  US10208044 Publication Date 2/19/2019 
Target
Name:
Acetyl-CoA carboxylase 2
Synonyms:
ACACB ACC-beta ACCB Acetyl-CoA carboxylase 2 Acetyl-CoA carboxylase 2 (ACC2)
Type:
Protein
Mol. Mass.:
276535.21
Organism:
Homo sapiens (Human)
Description:
O00763
Residue:
2458
  
Inhibitor
Name:
BDBM350113
Synonyms:
US10208044, Compound I-28
Type:
Small organic molecule
Emp. Form.:
C29H30FN3O8
Mol. Mass.:
567.5622
SMILES:
COc1ccc(F)cc1[C@H](Cn1c2ccc(cc2c(=O)n(c1=O)C(C)(C)C(O)=O)-c1ncco1)OC1CCOCC1
: