Target
Tyrosine-protein kinase BTK
Ligand
BDBM350150
Substrate
Meas. Tech.
Btk Enzyme Activity Assay
IC50
178±n/a nM
Citation
 Liu, JKozlowski, JAAndresen, BMBoga, SBGao, XGuiadeen, DGCai, JLiu, SWang, DWu, HYang, C Tertiary alcohol imidazopyrazine BTK inhibitors US Patent  US10208047 Publication Date 2/19/2019 
Target
Name:
Tyrosine-protein kinase BTK
Synonyms:
AGMX1 Agammaglobulinaemia tyrosine kinase B cell progenitor kinase BPK BTK_HUMAN Tyrosine Kinase BTK Tyrosine-protein kinase BTK (BTK)
Type:
Enzyme
Mol. Mass.:
76289.95
Organism:
Homo sapiens (Human)
Description:
Q06187
Residue:
659
  
Inhibitor
Name:
BDBM350150
Synonyms:
(1S,3R)-3-[8-amino-1-(4- {(1R)-1-hydroxy-1-[3- (trifluoromethyl)phenyl] ethyl}phenyl)imidazo[1,5- a]pyrazin-3-yl]-1,3- dimethylcyclopentane- carboxylic acid | US10208047, Example 18
Type:
Small organic molecule
Emp. Form.:
C29H29F3N4O3
Mol. Mass.:
538.5608
SMILES:
C[C@@](O)(c1ccc(cc1)-c1nc(n2ccnc(N)c12)[C@]1(C)CC[C@@](C)(C1)C(O)=O)c1cccc(c1)C(F)(F)F
: