Target
Egl nine homolog 1
Ligand
BDBM350277
Substrate
Meas. Tech.
Biological Assays
IC50
10.00±n/a nM
Citation
 Cai, JCrespo, ADebenham, JDu, XLiu, PLiu, RMadsen-Duggan, CBQuan, WSinz, CWang, L Inhibitors of HIF prolyl hydroxylase US Patent  US10208060 Publication Date 2/19/2019 
Target
Name:
Egl nine homolog 1
Synonyms:
C1orf12 EGLN1_HUMAN Hypoxia-inducible factor prolyl hydroxylase 2 (HIF-PH2) Prolyl hydroxylase domain-containing protein 2 (PHD2)
Type:
Protein
Mol. Mass.:
46035.59
Organism:
Homo sapiens (Human)
Description:
Q9GZT9
Residue:
426
  
Inhibitor
Name:
BDBM350277
Synonyms:
2-(4-hydroxy-2-oxo-1-(p- tolyl)-1,2,5,7- tetrahydrofuro[3,4-b]pyridine- 3-carboxamido)acetic acid | US10208060, Example 8
Type:
Small organic molecule
Emp. Form.:
C17H16N2O6
Mol. Mass.:
344.3187
SMILES:
Cc1ccc(cc1)-n1c2COCc2c(O)c(C(=O)NCC(O)=O)c1=O
: