Target
Phosphatidylinositol 4,5-bisphosphate 3-kinase catalytic subunit delta isoform
Ligand
BDBM350455
Substrate
Meas. Tech.
Transcreener KINASE Assay
IC50
2.00±n/a nM
Citation
 Su, WDai, GZhang, WDeng, W Imidazopyridazine compounds and their use US Patent  US10208066 Publication Date 2/19/2019 
Target
Name:
Phosphatidylinositol 4,5-bisphosphate 3-kinase catalytic subunit delta isoform
Synonyms:
PI3-kinase p110 subunit delta PI3-kinase subunit p110-delta PIK3CD Phosphatidylinositol 4,5-biphosphate 3-kinase catalytic subunit delta (PIK3CD) Phosphatidylinositol 4,5-bisphosphate 3-kinase 110 kDa catalytic subunit delta (PI3K delta) Phosphatidylinositol 4,5-bisphosphate 3-kinase catalytic subunit delta (PI3Kdelta) Phosphatidylinositol 4,5-bisphosphate 3-kinase catalytic subunit delta isoform (PI3K delta) Phosphatidylinositol 4,5-bisphosphate 3-kinase catalytic subunit delta isoform (PI3K-delta) Phosphatidylinositol 4,5-bisphosphate 3-kinase catalytic subunit delta isoform (PI3Kdelta)
Type:
Enzyme Subunit
Mol. Mass.:
119489.41
Organism:
Homo sapiens (Human)
Description:
O00329
Residue:
1044
  
Inhibitor
Name:
BDBM350455
Synonyms:
(chiral)-amino-6-((1-(3-chloro-6-(3-(2-hydroxypropan-2-yl)phenyl)imidazo[1,2-b]pyridazin-7-yl)ethyl)amino)pyrimidine-5-carbonitrile | US10208066, Compound 79
Type:
Small organic molecule
Emp. Form.:
C22H21ClN8O
Mol. Mass.:
448.908
SMILES:
C[C@H](Nc1ncnc(N)c1C#N)c1cc2ncc(Cl)n2nc1-c1cccc(c1)C(C)(C)O
: