Target
N-formyl peptide receptor 2
Ligand
BDBM350641
Substrate
Meas. Tech.
FLIPR
EC50
9100±n/a nM
Citation
 Beard, RLDonello, JEViswanath, V Use of agonists of formyl peptide receptor 2 for treating ocular inflammatory diseases US Patent  US10208071 Publication Date 2/19/2019 
Target
Name:
N-formyl peptide receptor 2
Synonyms:
ALXR, FPRL1, FPR2 FPR2 FPRH1 Formyl Peptide Receptor-Like 1 LXA4 receptor Lipoxin A4 receptor RFP | hFPRL
Type:
G Protein-Coupled Receptor (GPCR)
Mol. Mass.:
38968.35
Organism:
Homo sapiens (Human)
Description:
P25090
Residue:
351
  
Inhibitor
Name:
BDBM350641
Synonyms:
(2S)-{[(2S)-2-{[(4- bromophenyl)carbamoyl]amino}- 4-methylpentanoyl]amino} (phenyl)ethanoic acid US10434112, Compound 103 | US10799518, Compound 103
Type:
Small organic molecule
Emp. Form.:
C21H24BrN3O4
Mol. Mass.:
462.337
SMILES:
CC(C)C[C@H](NC(=O)Nc1ccc(Br)cc1)C(=O)N[C@H](C(O)=O)c1ccccc1
: