Target
Sigma intracellular receptor 2
Ligand
BDBM349566
Substrate
Meas. Tech.
Radioligand Binding Assay
Ki
10000±n/a nM
Citation
 Rishton, GCatalano, SMLook, GC Isoindoline compositions and methods for treating neurodegenerative disease US Patent  US9796672 Publication Date 10/24/2017 
Target
Name:
Sigma intracellular receptor 2
Synonyms:
MAC30 S2R Sigma-2 receptor TMEM97 | Transmembrane protein 97
Type:
Protein
Mol. Mass.:
20857.20
Organism:
Homo sapiens (Human)
Description:
Q5BJF2
Residue:
176
  
Inhibitor
Name:
BDBM349566
Synonyms:
US10207991, Ex. Cpd. No. 84 US11691947, Example 84
Type:
Small organic molecule
Emp. Form.:
C24H32N2O4
Mol. Mass.:
412.5219
SMILES:
COCCNC(=O)c1cccc2CN(Cc12)C(C)(C)CCc1ccc(O)c(OC)c1
: