Target
High affinity cAMP-specific 3',5'-cyclic phosphodiesterase 7A
Ligand
BDBM350886
Substrate
Meas. Tech.
Inhibition Assay
IC50
200±n/a nM
Citation
 Martinez Gil, AGil Ayuso-Gontan, CBPerez Fernandez, DIGarcia Fernandez, AM S-substituted quinazolines and their therapeutic applications for the treatment of diseases mediated by PDE7 US Patent  US9796687 Publication Date 10/24/2017 
Target
Name:
High affinity cAMP-specific 3',5'-cyclic phosphodiesterase 7A
Synonyms:
3',5'-cyclic phosphodiesterase PDE7A_HUMAN Phosphodiesterase 7 (PDE7) Phosphodiesterase 7A (PDE7A1)
Type:
Enzyme
Mol. Mass.:
55514.96
Organism:
Homo sapiens (Human)
Description:
Q13946
Residue:
482
  
Inhibitor
Name:
BDBM350886
Synonyms:
2-Cyclohexylmethylthio-3-phenyl-4-oxo-3,4-dihydroquinazoline | US9796687, Compound 1
Type:
Small organic molecule
Emp. Form.:
C21H22N2OS
Mol. Mass.:
350.477
SMILES:
O=c1n(c(SCC2CCCCC2)nc2ccccc12)-c1ccccc1
: