Target
High affinity cAMP-specific 3',5'-cyclic phosphodiesterase 7A
Ligand
BDBM350893
Substrate
Meas. Tech.
Inhibition Assay
IC50
4560±n/a nM
Citation
 Martinez Gil, AGil Ayuso-Gontan, CBPerez Fernandez, DIGarcia Fernandez, AM S-substituted quinazolines and their therapeutic applications for the treatment of diseases mediated by PDE7 US Patent  US9796687 Publication Date 10/24/2017 
Target
Name:
High affinity cAMP-specific 3',5'-cyclic phosphodiesterase 7A
Synonyms:
3',5'-cyclic phosphodiesterase PDE7A_HUMAN Phosphodiesterase 7 (PDE7) Phosphodiesterase 7A (PDE7A1)
Type:
Enzyme
Mol. Mass.:
55514.96
Organism:
Homo sapiens (Human)
Description:
Q13946
Residue:
482
  
Inhibitor
Name:
BDBM350893
Synonyms:
2-Cyclopropylmethylthio-3-(2,6-difluorophenyl)-8-methyl-4-oxo-3,4-dihydroquinazoline | US9796687, Compound 15
Type:
Small organic molecule
Emp. Form.:
C19H16F2N2OS
Mol. Mass.:
358.405
SMILES:
Cc1cccc2c1nc(SCC1CC1)n(-c1c(F)cccc1F)c2=O
: