Target
Vascular endothelial growth factor receptor 2
Ligand
BDBM227790
Substrate
Meas. Tech.
KDR (VEGFR-2) Kinase Assay
pH
7±n/a
IC50
0.525±n/a nM
Comments
extracted
Citation
 Schall, AKlar, JLobell, MSchirok, HTelser, JMüller, SBrohm, DBriem, HJörißen, HKeldenich, JBöttger, MVon Degenfeld, GSchlange, TBömer, ULindner, NEilken, HHristodorov, DWasnaire, PGericke, KMBärfacker, L Substituted pyridobenzodiazepinone-derivatives and use thereof US Patent  US10047096 Publication Date 8/14/2018 
Target
Name:
Vascular endothelial growth factor receptor 2
Synonyms:
CD_antigen=CD309 Fetal liver kinase 1 (FLK-1) KDR Protein-tyrosine kinase receptor Flk-1 VEGFR-2 VEGFR2 Vascular Endothelial Growth Factor Receptor Kinase 2 Vascular endothelial growth factor receptor 2 (KDR) Vascular endothelial growth factor receptor 2 (VEGFR2) Vascular endothelial growth factor receptor-2 (VEGFR-2)
Type:
Receptor Tyrosine Kinase
Mol. Mass.:
151510.97
Organism:
Homo sapiens (Human)
Description:
P35968
Residue:
1356
  
Inhibitor
Name:
BDBM227790
Synonyms:
8-{[Butyl(ethyl)amino]methyl}-4-[(2-fluoro-5-hydroxy-4-methylphenyl)amino]-6,11-dihydro-5H-pyrido[2,3-b][1,5]benzodiazepin-5-one | US10047096, 53
Type:
Small organic molecule
Emp. Form.:
C26H30FN5O2
Mol. Mass.:
463.5471
SMILES:
CCCCN(CC)Cc1ccc2Nc3nccc(Nc4cc(O)c(C)cc4F)c3C(=O)Nc2c1
: