Target
Vascular endothelial growth factor receptor 2
Ligand
BDBM227807
Substrate
Meas. Tech.
KDR (VEGFR-2) Kinase Assay
pH
7±n/a
IC50
0.670±n/a nM
Comments
extracted
Citation
 Schall, AKlar, JLobell, MSchirok, HTelser, JMüller, SBrohm, DBriem, HJörißen, HKeldenich, JBöttger, MVon Degenfeld, GSchlange, TBömer, ULindner, NEilken, HHristodorov, DWasnaire, PGericke, KMBärfacker, L Substituted pyridobenzodiazepinone-derivatives and use thereof US Patent  US10047096 Publication Date 8/14/2018 
Target
Name:
Vascular endothelial growth factor receptor 2
Synonyms:
CD_antigen=CD309 Fetal liver kinase 1 (FLK-1) KDR Protein-tyrosine kinase receptor Flk-1 VEGFR-2 VEGFR2 Vascular Endothelial Growth Factor Receptor Kinase 2 Vascular endothelial growth factor receptor 2 (KDR) Vascular endothelial growth factor receptor 2 (VEGFR2) Vascular endothelial growth factor receptor-2 (VEGFR-2)
Type:
Receptor Tyrosine Kinase
Mol. Mass.:
151510.97
Organism:
Homo sapiens (Human)
Description:
P35968
Residue:
1356
  
Inhibitor
Name:
BDBM227807
Synonyms:
US10047096, 69 US10047096, 71 | rac-4-[(2-Fluoro-5-hydroxy-4-methylphenyl)amino]-8-[(3-hydroxypiperidin-1-yl)methyl]-6,11-dihydro-5H-pyrido[2,3-b][1,5]benzodiazepin-5-one
Type:
Small organic molecule
Emp. Form.:
C25H26FN5O3
Mol. Mass.:
463.504
SMILES:
Cc1cc(F)c(Nc2ccnc3Nc4ccc(CN5CCCC(O)C5)cc4NC(=O)c23)cc1O
: