Target
Platelet-derived growth factor receptor beta
Ligand
BDBM227930
Substrate
Meas. Tech.
PDGFRbeta Kinase Assay
pH
7.5±n/a
Temperature
295.15±n/a K
IC50
0.626±n/a nM
Comments
extracted
Citation
 Schall, AKlar, JLobell, MSchirok, HTelser, JMüller, SBrohm, DBriem, HJörißen, HKeldenich, JBöttger, MVon Degenfeld, GSchlange, TBömer, ULindner, NEilken, HHristodorov, DWasnaire, PGericke, KMBärfacker, L Substituted pyridobenzodiazepinone-derivatives and use thereof US Patent  US10047096 Publication Date 8/14/2018 
Target
Name:
Platelet-derived growth factor receptor beta
Synonyms:
Beta-type platelet-derived growth factor receptor CD140b antigen PDGF Receptor Substrate PDGFR PDGFR-1 PDGFRB PGFRB_HUMAN Platelet-derived growth factor receptor 1 Platelet-derived growth factor receptor beta (PDGFR-beta) Platelet-derived growth factor receptor beta (PDGFRbeta) | VHL/PDGFRB
Type:
Enzyme
Mol. Mass.:
123922.25
Organism:
Homo sapiens (Human)
Description:
P09619
Residue:
1106
  
Inhibitor
Name:
BDBM227930
Synonyms:
US10047096, 191 | cis-Ethyl 3-[({4-[(2-fluoro-5-hydroxy-4-methylphenyl)amino]-5-oxo-6,11-dihydro-5H-pyrido[2,3-b][1,5]benzodiazepin-8-yl}methyl)amino]cyclobutanecarboxylate
Type:
Small organic molecule
Emp. Form.:
C27H28FN5O4
Mol. Mass.:
505.5407
SMILES:
CCOC(=O)[C@@H]1C[C@@H](C1)NCc1ccc2Nc3nccc(Nc4cc(O)c(C)cc4F)c3C(=O)Nc2c1
: