Target
Vascular endothelial growth factor receptor 1
Ligand
BDBM351323
Substrate
Meas. Tech.
AlphaScreen Assay
IC50
10500±n/a nM
Citation
 Rice, KDAnand, NKBussenius, JCostanzo, SKennedy, ARPeto, CJTsang, THBlazey, CM Substituted quinazolines as receptor-type kinase inhibitors US Patent  US9796704 Publication Date 10/24/2017 
Target
Name:
Vascular endothelial growth factor receptor 1
Synonyms:
FLT FRT Fms-like tyrosine kinase 1 Tyrosine-protein kinase FRT VEGFR-1 VGFR1_HUMAN Vascular endothelial growth factor receptor 1 (FLT1) Vascular endothelial growth factor receptor 1 and 2 (Flt-1 and KDR) Vascular permeability factor receptor vascular endothelial growth factor/vascular permeability factor receptor
Type:
Receptor Tyrosine Kinase
Mol. Mass.:
150800.23
Organism:
Homo sapiens (Human)
Description:
P17948
Residue:
1338
  
Inhibitor
Name:
BDBM351323
Synonyms:
N-(3,4-dichlorophenyl)-7-{[(8-methyl-8- azabicyclo[3.2.1]oct-3-yl)methyl]oxy}-6- (methyloxy)quinazolin-4-amine | US9796704, Entry 58
Type:
Small organic molecule
Emp. Form.:
C24H26Cl2N4O2
Mol. Mass.:
473.395
SMILES:
COc1cc2c(Nc3ccc(Cl)c(Cl)c3)ncnc2cc1OCC1CC2CCC(C1)N2C
: