Target
Ephrin type-A receptor 2
Ligand
BDBM351323
Substrate
Meas. Tech.
AlphaScreen Assay
IC50
<50±n/a nM
Citation
 Rice, KDAnand, NKBussenius, JCostanzo, SKennedy, ARPeto, CJTsang, THBlazey, CM Substituted quinazolines as receptor-type kinase inhibitors US Patent  US9796704 Publication Date 10/24/2017 
Target
Name:
Ephrin type-A receptor 2
Synonyms:
ECK EPHA2_HUMAN Epithelial cell kinase | Tyrosine-protein kinase receptor ECK
Type:
PROTEIN
Mol. Mass.:
108260.70
Organism:
Homo sapiens (Human)
Description:
ChEMBL_1505248
Residue:
976
  
Inhibitor
Name:
BDBM351323
Synonyms:
N-(3,4-dichlorophenyl)-7-{[(8-methyl-8- azabicyclo[3.2.1]oct-3-yl)methyl]oxy}-6- (methyloxy)quinazolin-4-amine | US9796704, Entry 58
Type:
Small organic molecule
Emp. Form.:
C24H26Cl2N4O2
Mol. Mass.:
473.395
SMILES:
COc1cc2c(Nc3ccc(Cl)c(Cl)c3)ncnc2cc1OCC1CC2CCC(C1)N2C
: