Target
Beta-secretase 1
Ligand
BDBM227982
Substrate
Meas. Tech.
BACE1 HTRF FRET Assay
pH
5±n/a
Ki
2.00±n/a nM
Comments
extracted
Citation
 Dai, XCumming, JNLiu, HScott, JD C5-C6-oxacyclic fused iminopyrimidinone compounds as bace inhibitors, compositions, and their use US Patent  US10047098 Publication Date 8/14/2018 
Target
Name:
Beta-secretase 1
Synonyms:
ASP2 Aspartyl protease 2 BACE1 Beta-secretase (BACE) Beta-secretase 1 (BACE 1) Beta-secretase 1 (BACE1) Beta-site amyloid precursor protein cleaving enzyme 1 Memapsin-2 beta-Secretase (BACE-1) | beta-Secretase (BACE1)
Type:
Protein
Mol. Mass.:
55755.10
Organism:
Homo sapiens (Human)
Description:
P56817
Residue:
501
  
Inhibitor
Name:
BDBM227982
Synonyms:
US10047098, 14
Type:
Small organic molecule
Emp. Form.:
C23H22FN5O3
Mol. Mass.:
435.4509
SMILES:
CN1C(=N)N[C@]2(CO[C@H](C[C@H]2C1=O)C1CC1)c1cc(Oc2cc(ccn2)C#N)ccc1F
: