Target
High affinity nerve growth factor receptor
Ligand
BDBM200612
Substrate
Meas. Tech.
ELISA Assay
IC50
47.9±n/a nM
Citation
 Andrews, SWHaas, JJiang, YZhang, G Method of treatment using substituted imidazo[1,2b]pyridazine compounds US Patent  US9796723 Publication Date 10/24/2017 
Target
Name:
High affinity nerve growth factor receptor
Synonyms:
2.7.10.1 NTRK1 NTRK1_HUMAN Neurotrophic tyrosine kinase receptor type 1 Synonyms=MTC TRK1-transforming tyrosine kinase protein TRKA GN Trk-A Tropomyosin-related kinase A Tyrosine kinase receptor Tyrosine kinase receptor A Tyrosine kinase receptor A (Trk-A) gp140trk | p140-TrkA
Type:
Mol. Mass.:
87498.18
Organism:
Homo sapiens (Human)
Description:
P04629
Residue:
796
  
Inhibitor
Name:
BDBM200612
Synonyms:
US10590139, Example 38 US9796723, 38
Type:
Small organic molecule
Emp. Form.:
C22H25F2N7O
Mol. Mass.:
441.477
SMILES:
C[C@@H]1CN(CCN1)C(=O)Nc1cnc2ccc(nn12)N1CCC[C@@H]1c1cc(F)ccc1F
: