Target
Serine/threonine-protein kinase pim-1
Ligand
BDBM352078
Substrate
Meas. Tech.
Enzyme Assay
IC50
<10±n/a nM
Citation
 Vechorkin, OLi, YZhuo, J Pyridineamine compounds useful as Pim kinase inhibitors US Patent  US9802918 Publication Date 10/31/2017 
Target
Name:
Serine/threonine-protein kinase pim-1
Synonyms:
PIM-1 Kinase PIM1_HUMAN Serine/threonine-protein kinase (PIM1) Serine/threonine-protein kinase PIM1 | Serine/threonine-protein kinase pim-1 (PIM1)
Type:
Protein
Mol. Mass.:
35681.82
Organism:
Homo sapiens (Human)
Description:
P11309
Residue:
313
  
Inhibitor
Name:
BDBM352078
Synonyms:
1-(4-{6-[({4-[(3S,5R)-3-Amino-5-methylpiperidin-1-yl]pyridin-3-yl}amino)methyl]-3-fluoropyridin-2-yl}-3,5-difluorophenyl)cyclopropanol | US9802918, Example 10
Type:
Small organic molecule
Emp. Form.:
C26H28F3N5O
Mol. Mass.:
483.5286
SMILES:
C[C@@H]1C[C@H](N)CN(C1)c1ccncc1NCc1ccc(F)c(n1)-c1c(F)cc(cc1F)C1(O)CC1
: