Target
Serine/threonine-protein kinase pim-1
Ligand
BDBM352082
Substrate
Meas. Tech.
Enzyme Assay
IC50
<10±n/a nM
Citation
 Vechorkin, OLi, YZhuo, J Pyridineamine compounds useful as Pim kinase inhibitors US Patent  US9802918 Publication Date 10/31/2017 
Target
Name:
Serine/threonine-protein kinase pim-1
Synonyms:
PIM-1 Kinase PIM1_HUMAN Serine/threonine-protein kinase (PIM1) Serine/threonine-protein kinase PIM1 | Serine/threonine-protein kinase pim-1 (PIM1)
Type:
Protein
Mol. Mass.:
35681.82
Organism:
Homo sapiens (Human)
Description:
P11309
Residue:
313
  
Inhibitor
Name:
BDBM352082
Synonyms:
(3R,4R,5S)-3-Amino-1-[3-({[6-(2,6-difluorophenyl)-5-fluoropyridin-2-yl]methyl}amino)pyridin-4-yl]-5-methylpiperidin-4-ol | US9802918, Example 14
Type:
Small organic molecule
Emp. Form.:
C23H24F3N5O
Mol. Mass.:
443.4648
SMILES:
C[C@H]1CN(C[C@@H](N)[C@@H]1O)c1ccncc1NCc1ccc(F)c(n1)-c1c(F)cccc1F
: