Target
Serine/threonine-protein kinase pim-3
Ligand
BDBM352090
Substrate
Meas. Tech.
Enzyme Assay
IC50
<10±n/a nM
Citation
 Vechorkin, OLi, YZhuo, J Pyridineamine compounds useful as Pim kinase inhibitors US Patent  US9802918 Publication Date 10/31/2017 
Target
Name:
Serine/threonine-protein kinase pim-3
Synonyms:
PIM3 Serine/threonine-protein kinase pim-3 (PIM3)
Type:
Protein
Mol. Mass.:
35888.19
Organism:
Homo sapiens (Human)
Description:
Q86V86
Residue:
326
  
Inhibitor
Name:
BDBM352090
Synonyms:
2-(6-((4-((3S,5R)-3-Amino-5-methylpiperidin-1-yl)pyridin-3-ylamino)methyl)-3-fluoropyridin-2-yl)-3-fluorobenzonitrile | US9802918, Example 22
Type:
Small organic molecule
Emp. Form.:
C24H24F2N6
Mol. Mass.:
434.4844
SMILES:
C[C@@H]1C[C@H](N)CN(C1)c1ccncc1NCc1ccc(F)c(n1)-c1c(F)cccc1C#N
: