Target
Serine/threonine-protein kinase pim-1
Ligand
BDBM352093
Substrate
Meas. Tech.
Enzyme Assay
IC50
<10±n/a nM
Citation
 Vechorkin, OLi, YZhuo, J Pyridineamine compounds useful as Pim kinase inhibitors US Patent  US9802918 Publication Date 10/31/2017 
Target
Name:
Serine/threonine-protein kinase pim-1
Synonyms:
PIM-1 Kinase PIM1_HUMAN Serine/threonine-protein kinase (PIM1) Serine/threonine-protein kinase PIM1 | Serine/threonine-protein kinase pim-1 (PIM1)
Type:
Protein
Mol. Mass.:
35681.82
Organism:
Homo sapiens (Human)
Description:
P11309
Residue:
313
  
Inhibitor
Name:
BDBM352093
Synonyms:
2-(4-{6-[({4-[(3R,4R,5S)-3-Amino-4-hydroxy-5-methylpiperidin-1-yl]pyridin-3-yl}amino)methyl]-3-fluoropyridin-2-yl}-3,5-difluorophenyl)-2-methylpropanenitrile | US9802918, Example 24
Type:
Small organic molecule
Emp. Form.:
C27H29F3N6O
Mol. Mass.:
510.554
SMILES:
C[C@H]1CN(C[C@@H](N)[C@@H]1O)c1ccncc1NCc1ccc(F)c(n1)-c1c(F)cc(cc1F)C(C)(C)C#N
: