Target
Mitogen-activated protein kinase kinase kinase 11
Ligand
BDBM354731
Substrate
Meas. Tech.
Radiometric Filter Plate Assay
IC50
<100±n/a nM
Citation
 Gelbard, HADewhurst, SGoodfellow, VSLoweth, CJWiemann, T Substituted pyrrolo[2,3-b]pyridines as MLK inhibitors US Patent  US9814704 Publication Date 11/14/2017 
Target
Name:
Mitogen-activated protein kinase kinase kinase 11
Synonyms:
M3K11_HUMAN MLK3 Mixed Lineage Kinase 3 (MLK3) SPRK
Type:
PROTEIN
Mol. Mass.:
92696.93
Organism:
Homo sapiens (Human)
Description:
ChEMBL_1460565
Residue:
847
  
Inhibitor
Name:
BDBM354731
Synonyms:
Preparation of 4-(3-(1H-indol-5-yl)-1H-pyrrolo[2,3-b]pyridin-5-yl)aniline US9814704, Example 8
Type:
Small organic molecule
Emp. Form.:
C21H16N4
Mol. Mass.:
324.3785
SMILES:
Nc1ccc(cc1)-c1cnc2[nH]cc(-c3ccc4[nH]ccc4c3)c2c1
: