Target
Phosphodiesterase
Ligand
BDBM355153
Substrate
Meas. Tech.
Fluorescence Polarization (FP) Assay
Ki
0.990±n/a nM
Citation
 Shen, DMEgbertson, MBerger, RQian, XQian, YHarper, BYang, MGuo, ZZRada, VLWang, DCernak, TASinz, CWang, MWilson, JEXu, S Pyrimidone carboxamide compounds as PDE2 inhibitors US Patent  US9815796 Publication Date 11/14/2017 
Target
Name:
Phosphodiesterase
Synonyms:
PDE2A3 | Phosphodiesterase A3 (PDE2A3)
Type:
Enzyme Catalytic Domain
Mol. Mass.:
105547.91
Organism:
Macaca mulatta (Rhesus macaque)
Description:
Residue:
941
  
Inhibitor
Name:
BDBM355153
Synonyms:
2-cyclopropyl-N-[(1R)-1-{3-fluoro-4- [(trifluoromethyl)sulfanyl]phenyl}-2- methylpropyl]-6-oxo-1,6- dihydropyrimidine-4-carboxamide | US9815796, Example 244
Type:
Small organic molecule
Emp. Form.:
C19H19F4N3O2S
Mol. Mass.:
429.432
SMILES:
CC(C)[C@@H](NC(=O)c1cc(=O)[nH]c(n1)C1CC1)c1ccc(SC(F)(F)F)c(F)c1
: