Target
cGMP-dependent 3',5'-cyclic phosphodiesterase
Ligand
BDBM355246
Substrate
Meas. Tech.
Fluorescence Polarization (FP) Assay
Ki
1.10±n/a nM
Citation
 Shen, DMEgbertson, MBerger, RQian, XQian, YHarper, BYang, MGuo, ZZRada, VLWang, DCernak, TASinz, CWang, MWilson, JEXu, S Pyrimidone carboxamide compounds as PDE2 inhibitors US Patent  US9815796 Publication Date 11/14/2017 
Target
Name:
cGMP-dependent 3',5'-cyclic phosphodiesterase
Synonyms:
CGS-PDE Homo sapiens phosphodiesterase 2A (PDE2A) PDE2A cGSPDE
Type:
Enzyme Catalytic Domain
Mol. Mass.:
105691.58
Organism:
Homo sapiens (Human)
Description:
O00408
Residue:
941
  
Inhibitor
Name:
BDBM355246
Synonyms:
US9815796, Example 337
Type:
Small organic molecule
Emp. Form.:
C23H22F3N3O2
Mol. Mass.:
429.4349
SMILES:
CC(C)(C)[C@@H](NC(=O)c1cc(=O)[nH]c(n1)-c1ccccc1)c1ccc(cc1)C(F)(F)F
: