Target
cGMP-dependent 3',5'-cyclic phosphodiesterase
Ligand
BDBM355346
Substrate
Meas. Tech.
Fluorescence Polarization (FP) Assay
Ki
1.20±n/a nM
Citation
 Shen, DMEgbertson, MBerger, RQian, XQian, YHarper, BYang, MGuo, ZZRada, VLWang, DCernak, TASinz, CWang, MWilson, JEXu, S Pyrimidone carboxamide compounds as PDE2 inhibitors US Patent  US9815796 Publication Date 11/14/2017 
Target
Name:
cGMP-dependent 3',5'-cyclic phosphodiesterase
Synonyms:
CGS-PDE Homo sapiens phosphodiesterase 2A (PDE2A) PDE2A cGSPDE
Type:
Enzyme Catalytic Domain
Mol. Mass.:
105691.58
Organism:
Homo sapiens (Human)
Description:
O00408
Residue:
941
  
Inhibitor
Name:
BDBM355346
Synonyms:
2-cyclopropyl-N-{(1R)-1-[3-fluoro-4- (trifluoromethoxy)phenyl]-2,2- dimethylpropyl}-6-oxo-1,6- dihydropyrimidine-4-carboxamide | US9815796, Example 437
Type:
Small organic molecule
Emp. Form.:
C20H21F4N3O3
Mol. Mass.:
427.3927
SMILES:
CC(C)(C)[C@@H](NC(=O)c1cc(=O)[nH]c(n1)C1CC1)c1ccc(OC(F)(F)F)c(F)c1
: