Target
Phosphodiesterase
Ligand
BDBM355373
Substrate
Meas. Tech.
Fluorescence Polarization (FP) Assay
Ki
0.600±n/a nM
Citation
 Shen, DMEgbertson, MBerger, RQian, XQian, YHarper, BYang, MGuo, ZZRada, VLWang, DCernak, TASinz, CWang, MWilson, JEXu, S Pyrimidone carboxamide compounds as PDE2 inhibitors US Patent  US9815796 Publication Date 11/14/2017 
Target
Name:
Phosphodiesterase
Synonyms:
PDE2A3 | Phosphodiesterase A3 (PDE2A3)
Type:
Enzyme Catalytic Domain
Mol. Mass.:
105547.91
Organism:
Macaca mulatta (Rhesus macaque)
Description:
Residue:
941
  
Inhibitor
Name:
BDBM355373
Synonyms:
N-{(1R)-1-[3-fluoro-4- (trifluoromethoxy)phenyl]-2,2- dimethylpropyl}-2-(4- methoxybenzyl)-6-oxo-1,6- dihydropyrimidine-4-carboxamide | US9815796, Example 464
Type:
Small organic molecule
Emp. Form.:
C25H25F4N3O4
Mol. Mass.:
507.4773
SMILES:
COc1ccc(Cc2nc(cc(=O)[nH]2)C(=O)N[C@@H](c2ccc(OC(F)(F)F)c(F)c2)C(C)(C)C)cc1
: