Target
C-X-C chemokine receptor type 3
Ligand
BDBM228186
Substrate
Meas. Tech.
FLIPR Assay
pH
7.4±n/a
IC50
0.900±n/a nM
Comments
extracted
Citation
 Caroff, EMeyer, E (R)-2-methyl-piperazine derivatives as CXCR3 receptor modulators US Patent  US10047080 Publication Date 8/14/2018 
Target
Name:
C-X-C chemokine receptor type 3
Synonyms:
AAO92295.1 C-X-C chemokine receptor type 3 (CXCR3) CXCR3 CXCR3_HUMAN chemokine (C-X-C motif) receptor 3
Type:
Enzyme Catalytic Domain
Mol. Mass.:
40665.65
Organism:
Homo sapiens (Human)
Description:
Residue:
368
  
Inhibitor
Name:
BDBM228186
Synonyms:
2-[3-(1-Hydroxy-ethyl)-[1,2,4]triazol-1-yl]-1-{(R)-2-methyl-4-[2-trifluoromethyl-4-(2-trifluoromethyl-pyrimidin-5-yl)-thiazol-5-yl]-piperazin-1-yl}-ethanone | US10047080, 12
Type:
Small organic molecule
Emp. Form.:
C21H21F6N7O2S
Mol. Mass.:
549.493
SMILES:
CC1CNCC(N1C(=O)Cn1cnc(CCO)n1)c1sc(cc1-c1cnc(nc1)C(F)(F)F)C(F)(F)F
: