Target
C-X-C chemokine receptor type 3
Ligand
BDBM228179
Substrate
Meas. Tech.
Receptor Internalization Assay (RIA)
IC50
148±n/a nM
Citation
 Caroff, EMeyer, E (R)-2-methyl-piperazine derivatives as CXCR3 receptor modulators US Patent  US10047080 Publication Date 8/14/2018 
Target
Name:
C-X-C chemokine receptor type 3
Synonyms:
AAO92295.1 C-X-C chemokine receptor type 3 (CXCR3) CXCR3 CXCR3_HUMAN chemokine (C-X-C motif) receptor 3
Type:
Enzyme Catalytic Domain
Mol. Mass.:
40665.65
Organism:
Homo sapiens (Human)
Description:
Residue:
368
  
Inhibitor
Name:
BDBM228179
Synonyms:
2-(3-Ethyl-[1,2,4]triazol-1-yl)-1-{(R)-2-methyl-4-[2-trifluoromethyl-4-(2-trifluoromethyl-pyrimidin-5-yl)-thiazol-5-yl]-piperazin-1-yl}-ethanone | US10047080, 6
Type:
Small organic molecule
Emp. Form.:
C21H21F6N7OS
Mol. Mass.:
533.493
SMILES:
CCc1ncn(CC(=O)N2C(C)CNCC2c2sc(cc2-c2cnc(nc2)C(F)(F)F)C(F)(F)F)n1
: