Target
Amine oxidase [flavin-containing] B
Ligand
BDBM254603
Substrate
Meas. Tech.
Biological Assays-Inhibition of LSD1
Ki
>40000±n/a nM
Citation
 Ortega Muñoz, AFyfe, MCMartinell Pedemonte, MEstiarte Martinez, MValls Vidal, NKurz, GCastro Palomino Laria, JC (Hetero)aryl cyclopropylamine compounds as LSD1 inhibitors US Patent  US10214477 Publication Date 2/26/2019 
Target
Name:
Amine oxidase [flavin-containing] B
Synonyms:
AOFB_HUMAN MAOB Monoamine oxidase type B (MAO B) Monoamine oxidase type B (MAOB)
Type:
Protein
Mol. Mass.:
58768.76
Organism:
Homo sapiens (Human)
Description:
P27338
Residue:
520
  
Inhibitor
Name:
BDBM254603
Synonyms:
US10214477, Example 5 US9670136, 3 (trans)-N1-((1S,2R)-2-phenylcyclopropyl)cyclohexane-1,4-diamine
Type:
Small organic molecule
Emp. Form.:
C15H22N2
Mol. Mass.:
230.3486
SMILES:
NC1CCC(CC1)N[C@@H]1C[C@H]1c1ccccc1
: