Target
Amine oxidase [flavin-containing] B
Ligand
BDBM356625
Substrate
Meas. Tech.
Biological Assays-Inhibition of LSD1
Ki
20500±n/a nM
Citation
 Ortega Muñoz, AFyfe, MCMartinell Pedemonte, MEstiarte Martinez, MValls Vidal, NKurz, GCastro Palomino Laria, JC (Hetero)aryl cyclopropylamine compounds as LSD1 inhibitors US Patent  US10214477 Publication Date 2/26/2019 
Target
Name:
Amine oxidase [flavin-containing] B
Synonyms:
AOFB_HUMAN MAOB Monoamine oxidase type B (MAO B) Monoamine oxidase type B (MAOB)
Type:
Protein
Mol. Mass.:
58768.76
Organism:
Homo sapiens (Human)
Description:
P27338
Residue:
520
  
Inhibitor
Name:
BDBM356625
Synonyms:
US10214477, Example 11
Type:
Small organic molecule
Emp. Form.:
C22H25F3N2O2
Mol. Mass.:
406.4413
SMILES:
OC1CCC(CC1)N[C@H]1C[C@@H]1c1ccc(OCc2cccc(c2)C(F)(F)F)nc1
: