Target
Amine oxidase [flavin-containing] A
Ligand
BDBM356626
Substrate
Meas. Tech.
Biological Assays-Inhibition of LSD1
Ki
20500±n/a nM
Citation
 Ortega Muñoz, AFyfe, MCMartinell Pedemonte, MEstiarte Martinez, MValls Vidal, NKurz, GCastro Palomino Laria, JC (Hetero)aryl cyclopropylamine compounds as LSD1 inhibitors US Patent  US10214477 Publication Date 2/26/2019 
Target
Name:
Amine oxidase [flavin-containing] A
Synonyms:
AOFA_HUMAN MAO-A Monoamine oxidase Monoamine oxidase type A (MAO A) Monoamine oxidase type A (MAOA)
Type:
Protein
Mol. Mass.:
59689.53
Organism:
Homo sapiens (Human)
Description:
P21397
Residue:
527
  
Inhibitor
Name:
BDBM356626
Synonyms:
US10214477, Example 12
Type:
Small organic molecule
Emp. Form.:
C23H26F3N3O2
Mol. Mass.:
433.4666
SMILES:
NC(=O)C1CCC(CC1)N[C@H]1C[C@@H]1c1ccc(OCc2cccc(c2)C(F)(F)F)nc1
: