Target
Amine oxidase [flavin-containing] A
Ligand
BDBM254555
Substrate
Meas. Tech.
Biological Assays-Inhibition of LSD1
Ki
20500±n/a nM
Citation
 Ortega Muñoz, AFyfe, MCMartinell Pedemonte, MEstiarte Martinez, MValls Vidal, NKurz, GCastro Palomino Laria, JC (Hetero)aryl cyclopropylamine compounds as LSD1 inhibitors US Patent  US10214477 Publication Date 2/26/2019 
Target
Name:
Amine oxidase [flavin-containing] A
Synonyms:
AOFA_HUMAN MAO-A Monoamine oxidase Monoamine oxidase type A (MAO A) Monoamine oxidase type A (MAOA)
Type:
Protein
Mol. Mass.:
59689.53
Organism:
Homo sapiens (Human)
Description:
P21397
Residue:
527
  
Inhibitor
Name:
BDBM254555
Synonyms:
US10214477, Example 14 US9670136, 14 N-(4-(((trans)-2-(6-(3-(trifluoromethyl)phenyl)pyridin-3-yl)cyclopropyl)amino)cyclohexyl)methanesulfonamide
Type:
Small organic molecule
Emp. Form.:
C22H26F3N3O2S
Mol. Mass.:
453.521
SMILES:
CS(=O)(=O)NC1CCC(CC1)N[C@H]1C[C@@H]1c1ccc(nc1)-c1cccc(c1)C(F)(F)F
: