Target
Amine oxidase [flavin-containing] A
Ligand
BDBM254556
Substrate
Meas. Tech.
Biological Assays-Inhibition of LSD1
Ki
20500±n/a nM
Citation
 Ortega Muñoz, AFyfe, MCMartinell Pedemonte, MEstiarte Martinez, MValls Vidal, NKurz, GCastro Palomino Laria, JC (Hetero)aryl cyclopropylamine compounds as LSD1 inhibitors US Patent  US10214477 Publication Date 2/26/2019 
Target
Name:
Amine oxidase [flavin-containing] A
Synonyms:
AOFA_HUMAN MAO-A Monoamine oxidase Monoamine oxidase type A (MAO A) Monoamine oxidase type A (MAOA)
Type:
Protein
Mol. Mass.:
59689.53
Organism:
Homo sapiens (Human)
Description:
P21397
Residue:
527
  
Inhibitor
Name:
BDBM254556
Synonyms:
US10214477, Example 15 US9670136, 15 (R)-1-(4-(((trans)-2-phenylcyclopropyl)amino)cyclohexyl)pyrrolidin-3-amine trihydrochloride
Type:
Small organic molecule
Emp. Form.:
C19H29N3
Mol. Mass.:
299.4537
SMILES:
N[C@@H]1CCN(C1)C1CCC(CC1)N[C@H]1C[C@@H]1c1ccccc1
: