Target
Lysine-specific histone demethylase 1A
Ligand
BDBM254556
Substrate
Meas. Tech.
Biological Assays-Inhibition of LSD1
Ki
50±n/a nM
Citation
 Ortega Muñoz, AFyfe, MCMartinell Pedemonte, MEstiarte Martinez, MValls Vidal, NKurz, GCastro Palomino Laria, JC (Hetero)aryl cyclopropylamine compounds as LSD1 inhibitors US Patent  US10214477 Publication Date 2/26/2019 
Target
Name:
Lysine-specific histone demethylase 1A
Synonyms:
AOF2 Flavin-containing amine oxidase domain-containing protein 2 KDM1A KIAA0601 Lysine-specific demethylase 1 (LSD1) Lysine-specific histone demethylase 1 (LSD1)
Type:
Enzyme
Mol. Mass.:
92901.01
Organism:
Homo sapiens (Human)
Description:
O60341
Residue:
852
  
Inhibitor
Name:
BDBM254556
Synonyms:
US10214477, Example 15 US9670136, 15 (R)-1-(4-(((trans)-2-phenylcyclopropyl)amino)cyclohexyl)pyrrolidin-3-amine trihydrochloride
Type:
Small organic molecule
Emp. Form.:
C19H29N3
Mol. Mass.:
299.4537
SMILES:
N[C@@H]1CCN(C1)C1CCC(CC1)N[C@H]1C[C@@H]1c1ccccc1
: