Target
Lysine-specific histone demethylase 1A
Ligand
BDBM356626
Substrate
Meas. Tech.
Biological Assays-Inhibition of LSD1
IC50
91.0±n/a nM
Citation
 Ortega Muñoz, AFyfe, MCMartinell Pedemonte, MEstiarte Martinez, MValls Vidal, NKurz, GCastro Palomino Laria, JC (Hetero)aryl cyclopropylamine compounds as LSD1 inhibitors US Patent  US10214477 Publication Date 2/26/2019 
Target
Name:
Lysine-specific histone demethylase 1A
Synonyms:
AOF2 Flavin-containing amine oxidase domain-containing protein 2 KDM1A KIAA0601 Lysine-specific demethylase 1 (LSD1) Lysine-specific histone demethylase 1 (LSD1)
Type:
Enzyme
Mol. Mass.:
92901.01
Organism:
Homo sapiens (Human)
Description:
O60341
Residue:
852
  
Inhibitor
Name:
BDBM356626
Synonyms:
US10214477, Example 12
Type:
Small organic molecule
Emp. Form.:
C23H26F3N3O2
Mol. Mass.:
433.4666
SMILES:
NC(=O)C1CCC(CC1)N[C@H]1C[C@@H]1c1ccc(OCc2cccc(c2)C(F)(F)F)nc1
: