Target
Lysine-specific histone demethylase 1A
Ligand
BDBM254561
Substrate
Meas. Tech.
Biological Assays-Inhibition of LSD1
IC50
34.0±n/a nM
Citation
 Ortega Muñoz, AFyfe, MCMartinell Pedemonte, MEstiarte Martinez, MValls Vidal, NKurz, GCastro Palomino Laria, JC (Hetero)aryl cyclopropylamine compounds as LSD1 inhibitors US Patent  US10214477 Publication Date 2/26/2019 
Target
Name:
Lysine-specific histone demethylase 1A
Synonyms:
AOF2 Flavin-containing amine oxidase domain-containing protein 2 KDM1A KIAA0601 Lysine-specific demethylase 1 (LSD1) Lysine-specific histone demethylase 1 (LSD1)
Type:
Enzyme
Mol. Mass.:
92901.01
Organism:
Homo sapiens (Human)
Description:
O60341
Residue:
852
  
Inhibitor
Name:
BDBM254561
Synonyms:
US10214477, Example 20 US9670136, 20 N1-((trans)-2-phenylcyclopropyl)-2,3-dihydro-H-indene-1,3-diamine
Type:
Small organic molecule
Emp. Form.:
C18H20N2
Mol. Mass.:
264.3648
SMILES:
NC1CC(N[C@H]2C[C@@H]2c2ccccc2)c2ccccc12
: