Target
Lysine-specific histone demethylase 1A
Ligand
BDBM356677
Substrate
Meas. Tech.
Biological Assays-Inhibition of LSD1
IC50
19.0±n/a nM
Citation
 Ortega Muñoz, AFyfe, MCMartinell Pedemonte, MEstiarte Martinez, MValls Vidal, NKurz, GCastro Palomino Laria, JC (Hetero)aryl cyclopropylamine compounds as LSD1 inhibitors US Patent  US10214477 Publication Date 2/26/2019 
Target
Name:
Lysine-specific histone demethylase 1A
Synonyms:
AOF2 Flavin-containing amine oxidase domain-containing protein 2 KDM1A KIAA0601 Lysine-specific demethylase 1 (LSD1) Lysine-specific histone demethylase 1 (LSD1)
Type:
Enzyme
Mol. Mass.:
92901.01
Organism:
Homo sapiens (Human)
Description:
O60341
Residue:
852
  
Inhibitor
Name:
BDBM356677
Synonyms:
US10214477, Example 52
Type:
Small organic molecule
Emp. Form.:
C26H38N5O2S
Mol. Mass.:
484.677
SMILES:
C[N]1(CCNCC1)S(=O)(=O)Nc1cccc(c1)-c1ccc(cc1)[C@H]1C[C@@H]1NC1CCC(N)CC1
: