Target
Lysine-specific histone demethylase 1A
Ligand
BDBM254598
Substrate
Meas. Tech.
Biological Assays-Inhibition of LSD1
IC50
12.0±n/a nM
Citation
 Ortega Muñoz, AFyfe, MCMartinell Pedemonte, MEstiarte Martinez, MValls Vidal, NKurz, GCastro Palomino Laria, JC (Hetero)aryl cyclopropylamine compounds as LSD1 inhibitors US Patent  US10214477 Publication Date 2/26/2019 
Target
Name:
Lysine-specific histone demethylase 1A
Synonyms:
AOF2 Flavin-containing amine oxidase domain-containing protein 2 KDM1A KIAA0601 Lysine-specific demethylase 1 (LSD1) Lysine-specific histone demethylase 1 (LSD1)
Type:
Enzyme
Mol. Mass.:
92901.01
Organism:
Homo sapiens (Human)
Description:
O60341
Residue:
852
  
Inhibitor
Name:
BDBM254598
Synonyms:
US10214477, Example 57 US9670136, 57 N1-((trans)-2-(4-((2-fluorobenzyl)oxy)phenyl)cyclopropyl)cyclohexane-1,4-diamine
Type:
Small organic molecule
Emp. Form.:
C22H27FN2O
Mol. Mass.:
354.461
SMILES:
NC1CCC(CC1)N[C@H]1C[C@@H]1c1ccc(OCc2ccccc2F)cc1
: