Target
Monocarboxylate transporter 1
Ligand
BDBM345304
Substrate
Meas. Tech.
MCT1-Mediated Lactate Transport in BT20 Breast Cancer Cells
IC50
34000±n/a nM
Citation
 Parnell, KMMcCall, JRomero, D Heterocyclic inhibitors of MCT4 US Patent  US10214492 Publication Date 2/26/2019 
Target
Name:
Monocarboxylate transporter 1
Synonyms:
MCT 1 MOT1_HUMAN SLC16A1 | Solute carrier family 16 member 1
Type:
PROTEIN
Mol. Mass.:
53956.64
Organism:
Homo sapiens (Human)
Description:
ChEMBL_1451367
Residue:
500
  
Inhibitor
Name:
BDBM345304
Synonyms:
2-([1-[(o-Chlorophenyl)methyl]-5-[m- (dimethylamino)phenyl]-1H-pyrazol-3- yl]methoxy)-2-methylpropionic acid MS: Calculated: 427.92; Found: 428.9 [M + H]. US10214492, Example 50 US11724989, Example 50
Type:
Small organic molecule
Emp. Form.:
C23H26ClN3O3
Mol. Mass.:
427.924
SMILES:
CN(C)c1cccc(c1)-c1cc(COC(C)(C)C(O)=O)nn1Cc1ccccc1Cl
: