Target
Period circadian protein homolog 2
Ligand
BDBM356648
Substrate
Meas. Tech.
Per2 Assay
EC50
609±n/a nM
Citation
 Bersot, RHumphries, P Carbazole-containing amides, carbamates, and ureas as cryptochrome modulators US Patent  US10214507 Publication Date 2/26/2019 
Target
Name:
Period circadian protein homolog 2
Synonyms:
Circadian clock protein PERIOD 2 PER2 Period circadian protein homolog 2 | hPER2
Type:
PROTEIN
Mol. Mass.:
136576.47
Organism:
Homo sapiens (Human)
Description:
ChEMBL_116705
Residue:
1255
  
Inhibitor
Name:
BDBM356648
Synonyms:
1-cyclopentyl-3-(3- (3,6-difluoro-9H- carbazol-9-yl)-2- hydroxypropyl)tetra- hydropyrimidin- 2(1H)-one US10759777, Compound 76
Type:
Small organic molecule
Emp. Form.:
C24H27F2N3O2
Mol. Mass.:
427.4869
SMILES:
OC(CN1CCCN(C2CCCC2)C1=O)Cn1c2ccc(F)cc2c2cc(F)ccc12
: