Target
Period circadian protein homolog 2
Ligand
BDBM356699
Substrate
Meas. Tech.
Per2 Assay
EC50
568±n/a nM
Citation
 Bersot, RHumphries, P Carbazole-containing amides, carbamates, and ureas as cryptochrome modulators US Patent  US10214507 Publication Date 2/26/2019 
Target
Name:
Period circadian protein homolog 2
Synonyms:
Circadian clock protein PERIOD 2 PER2 Period circadian protein homolog 2 | hPER2
Type:
PROTEIN
Mol. Mass.:
136576.47
Organism:
Homo sapiens (Human)
Description:
ChEMBL_116705
Residue:
1255
  
Inhibitor
Name:
BDBM356699
Synonyms:
1-(3-(9H-carbazol- 9-yl)-2- hydroxypropyl)-3- ethyltetrahydro- pyrimidin-2(1H)- one US10759777, Compound 95
Type:
Small organic molecule
Emp. Form.:
C21H25N3O2
Mol. Mass.:
351.4421
SMILES:
CCN1CCCN(CC(O)Cn2c3ccccc3c3ccccc23)C1=O
: