Target
Beta-secretase 1
Ligand
BDBM17783
Substrate
FS1 FRET Substrate
Meas. Tech.
BACE-1 Enzymatic Assay
pH
5±n/a
Temperature
295.15±n/a K
Ki
900±n/a nM
Citation
 Baxter, EWConway, KAKennis, LBischoff, FMercken, MHWinter, HLReynolds, CHTounge, BALuo, CScott, MKHuang, YBraeken, MPieters, SMBerthelot, DJMasure, SBruinzeel, WDJordan, ADParker, MHBoyd, REQu, JAlexander, RSBrenneman, DEReitz, AB 2-Amino-3,4-dihydroquinazolines as Inhibitors of BACE-1 (beta-Site APP Cleaving Enzyme): Use of Structure Based Design to Convert a Micromolar Hit into a Nanomolar Lead. J Med Chem 50:4261-4 (2007)  
Target
Name:
Beta-secretase 1
Synonyms:
ASP2 Aspartyl protease 2 BACE1 Beta-secretase (BACE) Beta-secretase 1 (BACE 1) Beta-secretase 1 (BACE1) Beta-site amyloid precursor protein cleaving enzyme 1 Memapsin-2 beta-Secretase (BACE-1) | beta-Secretase (BACE1)
Type:
Protein
Mol. Mass.:
55755.10
Organism:
Homo sapiens (Human)
Description:
P56817
Residue:
501
  
Inhibitor
Name:
BDBM17783
Synonyms:
2-aminoquinazoline, 1 | 3-(2-amino-6-benzoyl-3,4-dihydroquinazolin-3-yl)-N-cyclohexyl-N-methylpropanamide
Type:
Small organic molecule
Emp. Form.:
C25H30N4O2
Mol. Mass.:
418.5313
SMILES:
CN(C1CCCCC1)C(=O)CCN1Cc2cc(ccc2N=C1N)C(=O)c1ccccc1
:
Substrate
Name:
FS1 FRET Substrate
Synonyms:
Type:
Peptide
Mol. Mass.:
2858.98
Organism:
Description:
Residue:
24