Target
Genome polyprotein
Ligand
BDBM357799
Substrate
Meas. Tech.
HCV Replicon Luciferase Assay
EC50
2.30±n/a nM
Citation
 Wang, TZhang, ZParcella, KEEastman, KJKadow, JF Substituted 2-phenyl (AZA)benzofuran compounds for the treatment of hepatitis C US Patent  US10214534 Publication Date 2/26/2019 
Target
Name:
Genome polyprotein
Synonyms:
HCV Polymerase (S282T) NS3/4A Protein POLG_HCVJA
Type:
Protein
Mol. Mass.:
327076.78
Organism:
Hepatitis C Virus (Virus)
Description:
P26662
Residue:
3010
  
Inhibitor
Name:
BDBM357799
Synonyms:
US10214534, Compound 1003
Type:
Small organic molecule
Emp. Form.:
C36H36FN3O6S
Mol. Mass.:
657.751
SMILES:
CCN(c1cc2oc(c(C(=O)NC)c2cc1-c1cccc(c1)C(=O)NC(C)(C)C)-c1ccc(Oc2cccc(F)c2)cc1)S(C)(=O)=O
: