Target
Genome polyprotein
Ligand
BDBM357833
Substrate
Meas. Tech.
HCV Replicon Luciferase Assay
EC50
<100±n/a nM
Citation
 Wang, TZhang, ZParcella, KEEastman, KJKadow, JF Substituted 2-phenyl (AZA)benzofuran compounds for the treatment of hepatitis C US Patent  US10214534 Publication Date 2/26/2019 
Target
Name:
Genome polyprotein
Synonyms:
HCV Polymerase (S282T) NS3/4A Protein POLG_HCVJA
Type:
Protein
Mol. Mass.:
327076.78
Organism:
Hepatitis C Virus (Virus)
Description:
P26662
Residue:
3010
  
Inhibitor
Name:
BDBM357833
Synonyms:
US10214534, Compound 3001
Type:
Small organic molecule
Emp. Form.:
C33H36F3N3O4
Mol. Mass.:
595.6518
SMILES:
CCCCOc1ccc(cc1)-c1oc2nc(CCC(F)(F)F)c(cc2c1C(=O)NC)-c1cccc(c1)C(=O)NC(C)(C)C
: