Target
Lysosomal acid glucosylceramidase
Ligand
BDBM18483
Substrate
BDBM18429
Meas. Tech.
GC Enzyme Assay
IC50
1040±n/a nM
Citation
 Huang, WZheng, WUrban, DJInglese, JSidransky, EAustin, CPThomas, CJ N(4)-Phenyl modifications of N(2)-(2-hydroxyl)ethyl-6-(pyrrolidin-1-yl)-1,3,5-triazine-2,4-diamines enhance glucocerebrosidase inhibition by small molecules with potential as chemical chaperones for Gaucher disease. Bioorg Med Chem Lett 17:5783-9 (2007)  
Target
Name:
Lysosomal acid glucosylceramidase
Synonyms:
Acid beta-glucosidase Beta-glucocerebrosidase D-glucosyl-N-acylsphingosine glucohydrolase GBA1 GC GLUC Glucosylceramidase (GBA) Glucosylceramidase precursor (Beta-glucocerebrosidase) (Acid beta-glucosidase) (D-glucosyl-N-acylsphingosine glucohydrolase) (Alglucerase) (Imiglucerase) beta-glucocerebrosidase (GCase)
Type:
Enzyme
Mol. Mass.:
59724.64
Organism:
Homo sapiens (Human)
Description:
The beta-Glu activity was measured with commercially available beta-glucocerebrosidase (Ceredase) as the enzyme source.
Residue:
536
  
Inhibitor
Name:
BDBM18483
Synonyms:
2-[(4-{[2-(tert-butoxy)-5-chlorophenyl]amino}-6-(pyrrolidin-1-yl)-1,3,5-triazin-2-yl)amino]ethan-1-ol | triazine scaffold, 52
Type:
Small organic molecule
Emp. Form.:
C19H27ClN6O2
Mol. Mass.:
406.91
SMILES:
CC(C)(C)Oc1ccc(Cl)cc1Nc1nc(NCCO)nc(n1)N1CCCC1
:
Substrate
Name:
BDBM18429
Synonyms:
3-Phenoxazone 7-(beta-D-glucopyranoside) resorufin-beta-D-glucopyranoside
Type:
Small organic molecule
Emp. Form.:
C18H17NO8
Mol. Mass.:
375.3295
SMILES:
OC[C@H]1O[C@@H](Oc2ccc3nc4ccc(=O)cc4oc3c2)[C@H](O)[C@@H](O)[C@@H]1O
: