Target
Glucocorticoid receptor
Ligand
BDBM18732
Substrate
BDBM18207
Meas. Tech.
Fluorescence Polarization Competitive Binding Assay.
pH
7.4±n/a
Temperature
295.15±n/a K
IC50
>2000±n/a nM
Citation
 Takahashi, HBekkali, YCapolino, AJGilmore, TGoldrick, SEKaplita, PVLiu, LNelson, RMTerenzio, DWang, JZuvela-Jelaska, LProudfoot, JNabozny, GThomson, D Discovery and SAR study of novel dihydroquinoline-containing glucocorticoid receptor agonists. Bioorg Med Chem Lett 17:5091-5 (2007)  
Target
Name:
Glucocorticoid receptor
Synonyms:
GCR_HUMAN GRL Glucocorticoid receptor (GRFP) Nuclear receptor subfamily 3 group C member 1
Type:
Enzyme
Mol. Mass.:
85656.87
Organism:
Homo sapiens (Human)
Description:
P04150
Residue:
777
  
Inhibitor
Name:
BDBM18732
Synonyms:
6-(2-methoxyphenyl)-2,2-dimethyl-4-[phenyl(prop-2-en-1-yloxy)methyl]-1,2-dihydroquinoline | dihydroquinoline-based ligand, 21
Type:
Small organic molecule
Emp. Form.:
C28H29NO2
Mol. Mass.:
411.5354
SMILES:
COc1ccccc1-c1ccc2NC(C)(C)C=C(C(OCC=C)c3ccccc3)c2c1
:
Substrate
Name:
BDBM18207
Synonyms:
(1R,2S,10S,11S,13R,14R,15S,17S)-1-fluoro-14,17-dihydroxy-14-(2-hydroxyacetyl)-2,13,15-trimethyltetracyclo[8.7.0.0^{2,7}.0^{11,15}]heptadeca-3,6-dien-5-one US11554172, Compound Dexamethasone dexamethasone (tetramethyl-rhodamine conjugated )
Type:
Steroid
Emp. Form.:
C22H29FO5
Mol. Mass.:
392.4611
SMILES:
[H][C@@]12C[C@@H](C)[C@](O)(C(=O)CO)[C@@]1(C)C[C@H](O)[C@@]1(F)[C@@]2([H])CCC2=CC(=O)C=C[C@]12C
: