Target
Glucocorticoid receptor
Ligand
BDBM18735
Substrate
BDBM18207
Meas. Tech.
Fluorescence Polarization Competitive Binding Assay.
pH
7.4±n/a
Temperature
295.15±n/a K
IC50
1060±n/a nM
Citation
 Takahashi, HBekkali, YCapolino, AJGilmore, TGoldrick, SEKaplita, PVLiu, LNelson, RMTerenzio, DWang, JZuvela-Jelaska, LProudfoot, JNabozny, GThomson, D Discovery and SAR study of novel dihydroquinoline-containing glucocorticoid receptor agonists. Bioorg Med Chem Lett 17:5091-5 (2007)  
Target
Name:
Glucocorticoid receptor
Synonyms:
GCR_HUMAN GRL Glucocorticoid receptor (GRFP) Nuclear receptor subfamily 3 group C member 1
Type:
Enzyme
Mol. Mass.:
85656.87
Organism:
Homo sapiens (Human)
Description:
P04150
Residue:
777
  
Inhibitor
Name:
BDBM18735
Synonyms:
4-(1-methoxyethyl)-6-(2-methoxyphenyl)-2,2-dimethyl-1,2-dihydroquinoline | dihydroquinoline-based ligand, 24
Type:
Small organic molecule
Emp. Form.:
C21H25NO2
Mol. Mass.:
323.4287
SMILES:
COC(C)C1=CC(C)(C)Nc2ccc(cc12)-c1ccccc1OC
:
Substrate
Name:
BDBM18207
Synonyms:
(1R,2S,10S,11S,13R,14R,15S,17S)-1-fluoro-14,17-dihydroxy-14-(2-hydroxyacetyl)-2,13,15-trimethyltetracyclo[8.7.0.0^{2,7}.0^{11,15}]heptadeca-3,6-dien-5-one US11554172, Compound Dexamethasone dexamethasone (tetramethyl-rhodamine conjugated )
Type:
Steroid
Emp. Form.:
C22H29FO5
Mol. Mass.:
392.4611
SMILES:
[H][C@@]12C[C@@H](C)[C@](O)(C(=O)CO)[C@@]1(C)C[C@H](O)[C@@]1(F)[C@@]2([H])CCC2=CC(=O)C=C[C@]12C
: