Target
Progesterone receptor
Ligand
BDBM18732
Substrate
BDBM18627
Meas. Tech.
Fluorescence Polarization Competitive Binding Assay.
IC50
>2000±n/a nM
Citation
 Takahashi, HBekkali, YCapolino, AJGilmore, TGoldrick, SEKaplita, PVLiu, LNelson, RMTerenzio, DWang, JZuvela-Jelaska, LProudfoot, JNabozny, GThomson, D Discovery and SAR study of novel dihydroquinoline-containing glucocorticoid receptor agonists. Bioorg Med Chem Lett 17:5091-5 (2007)  
Target
Name:
Progesterone receptor
Synonyms:
NR3C3 PGR PRGR_HUMAN | progesterone
Type:
Protein
Mol. Mass.:
98979.52
Organism:
Homo sapiens (Human)
Description:
P06401
Residue:
933
  
Inhibitor
Name:
BDBM18732
Synonyms:
6-(2-methoxyphenyl)-2,2-dimethyl-4-[phenyl(prop-2-en-1-yloxy)methyl]-1,2-dihydroquinoline | dihydroquinoline-based ligand, 21
Type:
Small organic molecule
Emp. Form.:
C28H29NO2
Mol. Mass.:
411.5354
SMILES:
COc1ccccc1-c1ccc2NC(C)(C)C=C(C(OCC=C)c3ccccc3)c2c1
:
Substrate
Name:
BDBM18627
Synonyms:
(10S,11S,14S,15S,17R)-17-[4-(dimethylamino)phenyl]-14-hydroxy-15-methyl-14-(prop-1-yn-1-yl)tetracyclo[8.7.0.0^{2,7}.0^{11,15}]heptadeca-1,6-dien-5-one Mifepristone RU486 (tetramethyl-rhodamine conjugated)
Type:
Small organic molecule
Emp. Form.:
C29H35NO2
Mol. Mass.:
429.5937
SMILES:
[H][C@@]12CC[C@@](O)(C#CC)[C@@]1(C)C[C@@H](C1=C3CCC(=O)C=C3CC[C@@]21[H])c1ccc(cc1)N(C)C
: