Target
Serine/threonine-protein kinase pim-1
Ligand
BDBM360022
Substrate
Meas. Tech.
Enzyme Assay
IC50
<10±n/a nM
Citation
 Vechorkin, OLi, Y Bicyclic heteroaromatic carboxamide compounds useful as Pim kinase inhibitors US Patent  US9822124 Publication Date 11/21/2017 
Target
Name:
Serine/threonine-protein kinase pim-1
Synonyms:
PIM-1 Kinase PIM1_HUMAN Serine/threonine-protein kinase (PIM1) Serine/threonine-protein kinase PIM1 | Serine/threonine-protein kinase pim-1 (PIM1)
Type:
Protein
Mol. Mass.:
35681.82
Organism:
Homo sapiens (Human)
Description:
P11309
Residue:
313
  
Inhibitor
Name:
BDBM360022
Synonyms:
N-{4-[(1R,3S,5S)-3-Amino-5-methylcyclohexyl]pyridin-3-yl}-3-isopropylpyrazolo[1,5-a]pyrimidine-5-carboxamide | US9822124, Example 82
Type:
Small organic molecule
Emp. Form.:
C22H28N6O
Mol. Mass.:
392.4973
SMILES:
CC(C)c1cnn2ccc(nc12)C(=O)Nc1cnccc1[C@@H]1C[C@H](C)C[C@H](N)C1
: