Target
Muscarinic acetylcholine receptor M3
Ligand
BDBM360157
Substrate
Meas. Tech.
Binding Assay
Ki
4.50±n/a nM
Citation
 Kim, SIm, WCho, CChoi, SPark, JKim, MChoi, SLee, MCho, K Biphenyl derivatives and methods for preparing same US Patent  US9828339 Publication Date 11/28/2017 
Target
Name:
Muscarinic acetylcholine receptor M3
Synonyms:
ACM3_HUMAN Cholinergic, muscarinic M3 Muscarinic receptor M3 | RecName: Full=Muscarinic acetylcholine receptor M3
Type:
Enzyme
Mol. Mass.:
66151.03
Organism:
Homo sapiens (Human)
Description:
P20309
Residue:
590
  
Inhibitor
Name:
BDBM360157
Synonyms:
(R)-(1-methylpyrrolidin- | US9828339, Example 91
Type:
Small organic molecule
Emp. Form.:
C19H20F2N2O2
Mol. Mass.:
346.3711
SMILES:
CN1CC[C@@H](COC(=O)Nc2ccccc2-c2cc(F)cc(F)c2)C1
: