Target
Muscarinic acetylcholine receptor M3
Ligand
BDBM360276
Substrate
Meas. Tech.
Binding Assay
Ki
3.29±n/a nM
Citation
 Kim, SIm, WCho, CChoi, SPark, JKim, MChoi, SLee, MCho, K Biphenyl derivatives and methods for preparing same US Patent  US9828339 Publication Date 11/28/2017 
Target
Name:
Muscarinic acetylcholine receptor M3
Synonyms:
ACM3_HUMAN Cholinergic, muscarinic M3 Muscarinic receptor M3 | RecName: Full=Muscarinic acetylcholine receptor M3
Type:
Enzyme
Mol. Mass.:
66151.03
Organism:
Homo sapiens (Human)
Description:
P20309
Residue:
590
  
Inhibitor
Name:
BDBM360276
Synonyms:
(S)-(1-methyl- | US9828339, Example 181
Type:
Small organic molecule
Emp. Form.:
C19H18ClF3N2O2
Mol. Mass.:
398.807
SMILES:
CN1CCC[C@H]1COC(=O)Nc1cc(F)c(F)cc1-c1ccc(F)c(Cl)c1
: